{"text_format":"1","workbook":"xlsx","n_sheets":3,"sheets":["DIV 3 Gr A","DIV 3 Gr B","CLASST "],"not_rendered":{"charts":0,"images":7,"macros":1,"external_links":0,"defined_names":2,"comments":0,"pivot_tables":0},"unopened":[],"bounds":{"document_bytes":16777216,"sheet_cells":100000,"rows_first":2000,"rows_last":500,"rows_between":2000,"halvings":0,"cell_chars":16384,"cell_head_chars":4096},"cells_cut":0,"cells_raw":0,"read":"whole","date_system":"1900"}

{"sheet":"DIV 3 Gr A","index":0,"n_rows":328,"n_cols":22,"rows_kept":328,"cut":false,"hidden":false,"merged":[[10,2,10,5],[5,2,5,5],[0,2,0,5],[5,6,5,9],[0,6,0,9],[10,6,10,9],[12,6,12,9],[13,6,13,7],[26,1,26,10],[27,1,27,10],[20,2,20,5],[15,2,15,5],[18,11,19,11],[14,11,15,11],[16,11,17,11],[28,1,28,10],[29,1,29,10]]}
[1,"EXEMPT","Match 1: à COURLON - Dimanche 01 Septembre à 8H30",null,null,null,"Match 6: à SENAN - Dimanche 06 Octobre à 14H00",null,null,null,null,null,null,null,null,null,null,"Pt","TPt","T+/-","+","-"]
[2,"COURLON 1",{"$f":"$B$1","v":"EXEMPT"},{"$f":"$B$2","v":"COURLON 1"},"F",{"$f":"IF(E2=\"\",\"\",IF(E2=\"F\",\"G\",IF(E2=\"G\",\"F\",36-E2)))","v":"G"},{"$f":"$B$1","v":"EXEMPT"},{"$f":"$B$6","v":"ST MARTIN DU TERTRE 1"},"F",{"$f":"IF(I2=\"\",\"\",IF(I2=\"F\",\"G\",IF(I2=\"G\",\"F\",36-I2)))","v":"G"},null,null,null,null,null,"CHAMPIGNY 1",26,{"$f":"IF(Q2=\"\",\"\",IF(Q2=\"F\",0,IF(Q2=18,2,IF(Q2>18,3,1))))","v":3},null,null,{"$f":"IF(Q2=\"G\",19,IF(Q2=\"\",0,Q2))","v":26},{"$f":"IF(Q2=\"\",\"\",IF(U2=36,36,IF(U2=0,-36,IF(U2=19,19,IF(U2=\"f\",-19,U2-(36-U2))))))","v":16}]
[3,"CHAMPIGNY 1",{"$f":"$B$3","v":"CHAMPIGNY 1"},{"$f":"$B$4","v":"ST FLORENTIN 3"},26,{"$f":"IF(E3=\"\",\"\",IF(E3=\"F\",\"G\",IF(E3=\"G\",\"F\",36-E3)))","v":10},{"$f":"$B$3","v":"CHAMPIGNY 1"},{"$f":"$B$5","v":"VILLENEUVE PETANQUE 1"},18,{"$f":"IF(I3=\"\",\"\",IF(I3=\"F\",\"G\",IF(I3=\"G\",\"F\",36-I3)))","v":18},null,null,null,null,null,"CHAMPIGNY 1",24,3,null,null,{"$f":"IF(Q3=\"G\",19,IF(Q3=\"\",0,Q3))","v":24},{"$f":"IF(Q3=\"\",\"\",IF(U3=36,36,IF(U3=0,-36,IF(U3=19,19,IF(U3=\"f\",-19,U3-(36-U3))))))","v":12}]
[4,"ST FLORENTIN 3",{"$f":"$B$5","v":"VILLENEUVE PETANQUE 1"},{"$f":"$B$6","v":"ST MARTIN DU TERTRE 1"},12,{"$f":"IF(E4=\"\",\"\",IF(E4=\"F\",\"G\",IF(E4=\"G\",\"F\",36-E4)))","v":24},{"$f":"$B$7","v":"SENAN 3"},{"$f":"$B$4","v":"ST FLORENTIN 3"},14,{"$f":"IF(I4=\"\",\"\",IF(I4=\"F\",\"G\",IF(I4=\"G\",\"F\",36-I4)))","v":22},null,null,null,null,null,"CHAMPIGNY 1",14,1,null,null,14,-8]
[5,"VILLENEUVE PETANQUE 1",{"$f":"$B$7","v":"SENAN 3"},{"$f":"$B$8","v":"MIGENNES 3"},28,{"$f":"IF(E5=\"\",\"\",IF(E5=\"F\",\"G\",IF(E5=\"G\",\"F\",36-E5)))","v":8},{"$f":"$B$8","v":"MIGENNES 3"},{"$f":"$B$2","v":"COURLON 1"},14,{"$f":"IF(I5=\"\",\"\",IF(I5=\"F\",\"G\",IF(I5=\"G\",\"F\",36-I5)))","v":22},null,null,null,null,null,"CHAMPIGNY 1",28,3,null,null,28,20]
[6,"ST MARTIN DU TERTRE 1","Match 2: à COURLON - Dimanche 01 Septembre à 14h00",null,null,null,"Match 7 et Finale: à MIGENNES - Dimanche 20 Octobre à 8H30",null,null,null,null,null,null,null,null,"CHAMPIGNY 1","G",3,null,null,19,19]
[7,"SENAN 3",{"$f":"$B$4","v":"ST FLORENTIN 3"},{"$f":"$B$1","v":"EXEMPT"},"G",{"$f":"IF(E7=\"\",\"\",IF(E7=\"F\",\"G\",IF(E7=\"G\",\"F\",36-E7)))","v":"F"},{"$f":"$B$6","v":"ST MARTIN DU TERTRE 1"},{"$f":"$B$7","v":"SENAN 3"},26,{"$f":"IF(I7=\"\",\"\",IF(I7=\"F\",\"G\",IF(I7=\"G\",\"F\",36-I7)))","v":10},null,null,null,null,null,"CHAMPIGNY 1",18,2,null,null,18,0]
[8,"MIGENNES 3",{"$f":"$B$6","v":"ST MARTIN DU TERTRE 1"},{"$f":"$B$3","v":"CHAMPIGNY 1"},12,{"$f":"IF(E8=\"\",\"\",IF(E8=\"F\",\"G\",IF(E8=\"G\",\"F\",36-E8)))","v":24},{"$f":"$B$4","v":"ST FLORENTIN 3"},{"$f":"$B$2","v":"COURLON 1"},22,{"$f":"IF(I8=\"\",\"\",IF(I8=\"F\",\"G\",IF(I8=\"G\",\"F\",36-I8)))","v":14},null,null,null,null,null,"CHAMPIGNY 1",10,1,{"$f":"SUM(R2:R8)","v":16},{"$f":"SUM(V2:V8)","v":43},10,-16]
[null,null,{"$f":"$B$2","v":"COURLON 1"},{"$f":"$B$7","v":"SENAN 3"},8,{"$f":"IF(E9=\"\",\"\",IF(E9=\"F\",\"G\",IF(E9=\"G\",\"F\",36-E9)))","v":28},{"$f":"$B$5","v":"VILLENEUVE PETANQUE 1"},{"$f":"$B$1","v":"EXEMPT"},"G",{"$f":"IF(I9=\"\",\"\",IF(I9=\"F\",\"G\",IF(I9=\"G\",\"F\",36-I9)))","v":"F"},null,null,null,null,null,"COURLON 1","G",3,null,null,19,19]
[null,null,{"$f":"$B$8","v":"MIGENNES 3"},{"$f":"$B$5","v":"VILLENEUVE PETANQUE 1"},10,{"$f":"IF(E10=\"\",\"\",IF(E10=\"F\",\"G\",IF(E10=\"G\",\"F\",36-E10)))","v":26},{"$f":"$B$3","v":"CHAMPIGNY 1"},{"$f":"$B$8","v":"MIGENNES 3"},10,{"$f":"IF(I10=\"\",\"\",IF(I10=\"F\",\"G\",IF(I10=\"G\",\"F\",36-I10)))","v":26},null,null,null,null,null,"COURLON 1",8,1,null,null,8,-20]
["Rappel:",null,"Match 3: à CHAMPIGNY - Dimanche 08 Septembre à 8h30",null,null,null,null,null,null,null,null,null,null,null,null,"COURLON 1",22,3,null,null,22,8]
["Seules les Cases Blanches",null,{"$f":"$B$4","v":"ST FLORENTIN 3"},{"$f":"$B$5","v":"VILLENEUVE PETANQUE 1"},16,{"$f":"IF(E12=\"\",\"\",IF(E12=\"F\",\"G\",IF(E12=\"G\",\"F\",36-E12)))","v":20},null,null,null,null,null,null,null,null,null,"COURLON 1",30,3,null,null,30,24]
["sont à remplir",null,{"$f":"$B$2","v":"COURLON 1"},{"$f":"$B$3","v":"CHAMPIGNY 1"},22,{"$f":"IF(E13=\"\",\"\",IF(E13=\"F\",\"G\",IF(E13=\"G\",\"F\",36-E13)))","v":14},"Classement",null,null,null,null,null,null,null,null,"COURLON 1",8,1,null,null,8,-20]
[null,null,{"$f":"$B$7","v":"SENAN 3"},{"$f":"$B$1","v":"EXEMPT"},"G",{"$f":"IF(E14=\"\",\"\",IF(E14=\"F\",\"G\",IF(E14=\"G\",\"F\",36-E14)))","v":"F"},null,null,"Pts","+/-",null,null,null,null,null,"COURLON 1",22,3,null,null,22,8]
[null,null,{"$f":"$B$6","v":"ST MARTIN DU TERTRE 1"},{"$f":"$B$8","v":"MIGENNES 3"},18,{"$f":"IF(E15=\"\",\"\",IF(E15=\"F\",\"G\",IF(E15=\"G\",\"F\",36-E15)))","v":18},1,"CHAMPIGNY 1",16,43,null,null,null,null,null,"COURLON 1",14,1,{"$f":"SUM(R9:R15)","v":15},{"$f":"SUM(V9:V15)","v":11},14,-8]
[null,null,"Match 4:  à CHAMPIGNY - Dimanche 08 Septembre à 14H00",null,null,null,2,"ST MARTIN DU TERTRE 1",16,43,null,null,null,null,null,"EXEMPT","F",0,null,null,"F",-19]
[null,null,{"$f":"$B$5","v":"VILLENEUVE PETANQUE 1"},{"$f":"$B$2","v":"COURLON 1"},6,{"$f":"IF(E17=\"\",\"\",IF(E17=\"F\",\"G\",IF(E17=\"G\",\"F\",36-E17)))","v":30},3,"VILLENEUVE PETANQUE 1",16,11,null,null,null,null,null,"EXEMPT","F",0,null,null,"F",-19]
[null,null,{"$f":"$B$6","v":"ST MARTIN DU TERTRE 1"},{"$f":"$B$4","v":"ST FLORENTIN 3"},12,{"$f":"IF(E18=\"\",\"\",IF(E18=\"F\",\"G\",IF(E18=\"G\",\"F\",36-E18)))","v":24},4,"ST FLORENTIN 3",15,-1,null,null,null,null,null,"EXEMPT","F",0,null,null,"F",-19]
[null,null,{"$f":"$B$3","v":"CHAMPIGNY 1"},{"$f":"$B$7","v":"SENAN 3"},28,{"$f":"IF(E19=\"\",\"\",IF(E19=\"F\",\"G\",IF(E19=\"G\",\"F\",36-E19)))","v":8},5,"COURLON 1",15,11,null,null,null,null,null,"EXEMPT","F",0,null,null,"F",-19]
[null,null,{"$f":"$B$1","v":"EXEMPT"},{"$f":"$B$8","v":"MIGENNES 3"},"F",{"$f":"IF(E20=\"\",\"\",IF(E20=\"F\",\"G\",IF(E20=\"G\",\"F\",36-E20)))","v":"G"},6,"MIGENNES 3",14,19,null,null,null,null,null,"EXEMPT","F",0,null,null,"F",-19]
[null,null,"Match 5: à SENAN - Dimanche 06 Octobre à 8H30",null,null,null,7,"SENAN 3",13,7,null,null,null,null,null,"EXEMPT","F",0,null,null,"F",-19]
[null,null,{"$f":"$B$1","v":"EXEMPT"},{"$f":"$B$3","v":"CHAMPIGNY 1"},"F",{"$f":"IF(E22=\"\",\"\",IF(E22=\"F\",\"G\",IF(E22=\"G\",\"F\",36-E22)))","v":"G"},8,"EXEMPT",0,-133,null,null,null,null,null,"EXEMPT","F",0,{"$f":"SUM(R16:R22)","v":0},{"$f":"SUM(V16:V22)","v":-133},"F",-19]
[null,null,{"$f":"$B$2","v":"COURLON 1"},{"$f":"$B$6","v":"ST MARTIN DU TERTRE 1"},8,{"$f":"IF(E23=\"\",\"\",IF(E23=\"F\",\"G\",IF(E23=\"G\",\"F\",36-E23)))","v":28},null,null,null,null,null,null,null,null,null,"MIGENNES 3",8,1,null,null,8,-20]
[null,null,{"$f":"$B$7","v":"SENAN 3"},{"$f":"$B$5","v":"VILLENEUVE PETANQUE 1"},14,{"$f":"IF(E24=\"\",\"\",IF(E24=\"F\",\"G\",IF(E24=\"G\",\"F\",36-E24)))","v":22},null,"CHAMPIGNY 1",5,12,null,null,null,null,null,"MIGENNES 3",10,1,null,null,10,-16]
[null,null,{"$f":"$B$8","v":"MIGENNES 3"},{"$f":"$B$4","v":"ST FLORENTIN 3"},32,{"$f":"IF(E25=\"\",\"\",IF(E25=\"F\",\"G\",IF(E25=\"G\",\"F\",36-E25)))","v":4},null,"ST MARTIN DU TERTRE 1",4,0,0,null,null,null,null,"MIGENNES 3",18,2,null,null,18,0]
[null,null,null,null,null,null,null,"VILLENEUVE PETANQUE 1",3,-12,null,null,null,null,null,"MIGENNES 3","G",3,null,null,19,19]
[null,"FÉDÉRATION FRANÇAISE DE PÉTANQUE ET JEU PROVENÇAL",null,null,null,null,null,null,null,null,null,null,null,null,null,"MIGENNES 3",32,3,null,null,32,28]
[null,"AGRÉÉE PAR LE MINISTÈRE DE LA JEUNESSE ET  DES SPORTS ",null,null,null,null,null,null,null,null,null,null,null,null,null,"MIGENNES 3",14,1,null,null,14,-8]
[null,"TERRITOIRE DE BOURGOGNE ",null,null,null,null,null,null,null,null,null,null,null,null,null,"MIGENNES 3",26,3,{"$f":"SUM(R23:R29)","v":14},{"$f":"SUM(V23:V29)","v":19},26,16]
[null,"Championnat Départemental des Clubs 2024  Division 4 Groupe A",null,null,null,null,null,null,null,null,null,null,null,null,null,"SENAN 3",28,3,null,null,28,20]
[null,null,null,null,null,null,null,null,null,null,null,null,null,null,null,"SENAN 3",28,3,null,null,28,20]
[null,null,null,null,null,null,null,null,null,null,null,null,null,null,null,"SENAN 3","G",3,null,null,19,19]
[null,null,null,null,null,null,null,null,null,null,null,null,null,null,null,"SENAN 3",8,1,null,null,8,-20]
[null,null,null,null,null,null,null,null,null,null,null,null,null,null,null,"SENAN 3",14,1,null,null,14,-8]
[null,null,null,null,null,null,null,null,null,null,null,null,null,null,null,"SENAN 3",14,1,null,null,14,-8]
[null,null,null,null,null,null,null,null,null,null,null,null,null,null,null,"SENAN 3",10,1,{"$f":"SUM(R30:R36)","v":13},{"$f":"SUM(V30:V36)","v":7},10,-16]
[null,null,null,null,null,null,null,null,null,null,null,null,null,null,null,"ST FLORENTIN 3",10,1,null,null,10,-16]
[null,null,null,null,null,null,null,null,null,null,null,null,null,null,null,"ST FLORENTIN 3","G",3,null,null,19,19]
[null,null,null,null,null,null,null,null,null,null,null,null,null,null,null,"ST FLORENTIN 3",16,1,null,null,16,-4]
[null,null,null,null,null,null,null,null,null,null,null,null,null,null,null,"ST FLORENTIN 3",24,3,null,null,24,12]
[null,null,null,null,null,null,null,null,null,null,null,null,null,null,null,"ST FLORENTIN 3",4,1,null,null,4,-28]
[null,null,null,null,null,null,null,null,null,null,null,null,null,null,null,"ST FLORENTIN 3",22,3,null,null,22,8]
[null,null,null,null,null,null,null,null,null,null,null,null,null,null,null,"ST FLORENTIN 3",22,3,{"$f":"SUM(R37:R43)","v":15},{"$f":"SUM(V37:V43)","v":-1},22,8]
[null,null,null,null,null,null,null,null,null,null,null,null,null,null,null,"ST MARTIN DU TERTRE 1",24,3,null,null,24,12]
[null,null,null,null,null,null,null,null,null,null,null,null,null,null,null,"ST MARTIN DU TERTRE 1",12,1,null,null,12,-12]
[null,null,null,null,null,null,null,null,null,null,null,null,null,null,null,"ST MARTIN DU TERTRE 1",18,2,null,null,18,0]
[null,null,null,null,null,null,null,null,null,null,null,null,null,null,null,"ST MARTIN DU TERTRE 1",12,1,null,null,12,-12]
[null,null,null,null,null,null,null,null,null,null,null,null,null,null,null,"ST MARTIN DU TERTRE 1",28,3,null,null,28,20]
[null,null,null,null,null,null,null,null,null,null,null,null,null,null,null,"ST MARTIN DU TERTRE 1","G",3,null,null,19,19]
[null,null,null,null,null,null,null,null,null,null,null,null,null,null,null,"ST MARTIN DU TERTRE 1",26,3,{"$f":"SUM(R44:R50)","v":16},{"$f":"SUM(V44:V50)","v":43},26,16]
[null,null,null,null,null,null,null,null,null,null,null,null,null,null,null,"VILLENEUVE PETANQUE 1",12,1,null,null,12,-12]
[null,null,null,null,null,null,null,null,null,null,null,null,null,null,null,"VILLENEUVE PETANQUE 1",26,3,null,null,26,16]
[null,null,null,null,null,null,null,null,null,null,null,null,null,null,null,"VILLENEUVE PETANQUE 1",20,3,null,null,20,4]
[null,null,null,null,null,null,null,null,null,null,null,null,null,null,null,"VILLENEUVE PETANQUE 1",6,1,null,null,6,-24]
[null,null,null,null,null,null,null,null,null,null,null,null,null,null,null,"VILLENEUVE PETANQUE 1",22,3,null,null,22,8]
[null,null,null,null,null,null,null,null,null,null,null,null,null,null,null,"VILLENEUVE PETANQUE 1",18,2,null,null,18,0]
[null,null,null,null,null,null,null,null,null,null,null,null,null,null,null,"VILLENEUVE PETANQUE 1","G",3,{"$f":"SUM(R51:R57)","v":16},{"$f":"SUM(V51:V57)","v":11},19,19]
[null,null,null,null,null,null,null,null,null,null,null,null,null,null,null,null,null,null,null,null,null,{"$f":"IF(U58=0,\"\",IF(U58=19,\"\",U58-(36-U58)))","v":""}]
[]
[]
[]
[]
[]
[]
[]
[]
[]
[]
[]
[]
[]
[]
[]
[]
[]
[]
[]
[]
[]
[]
[]
[]
[]
[]
[]
[]
[]
[]
[]
[]
[]
[]
[]
[]
[]
[]
[]
[]
[]
[]
[]
[]
[]
[]
[]
[]
[]
[]
[]
[]
[]
[]
[]
[]
[]
[]
[]
[]
[]
[]
[]
[]
[]
[]
[]
[]
[]
[]
[]
[]
[]
[]
[]
[]
[]
[]
[]
[]
[]
[]
[]
[]
[]
[]
[]
[]
[]
[]
[]
[]
[]
[]
[]
[]
[]
[]
[]
[]
[]
[]
[]
[]
[]
[]
[]
[]
[]
[]
[]
[]
[]
[]
[]
[]
[]
[]
[]
[]
[]
[]
[]
[]
[]
[]
[]
[]
[]
[]
[]
[]
[]
[]
[]
[]
[]
[]
[]
[]
[]
[]
[]
[]
[]
[]
[]
[]
[]
[]
[]
[]
[]
[]
[]
[]
[]
[]
[]
[]
[]
[]
[]
[]
[]
[]
[]
[]
[]
[]
[]
[]
[]
[]
[]
[]
[]
[]
[]
[]
[]
[]
[]
[]
[]
[]
[]
[]
[]
[]
[]
[]
[]
[]
[]
[]
[]
[]
[]
[]
[]
[]
[]
[]
[]
[]
[]
[]
[]
[]
[]
[]
[]
[]
[]
[]
[]
[]
[]
[]
[]
[]
[]
[]
[]
[]
[]
[]
[]
[]
[]
[]
[]
[]
[]
[null,"1) Remplir la liste des Clubs composant le Groupe (Colonne B1 à B14)"]
[]
[null,"2) Le calendrier se fait automatiquement"]
[]
[null,"3) Pour chaque rencontre: mettre uniquemment le score de la premiere équipe (Case Blanche,la rouge sera remplie automatiquement)"]
[]
[null,"4) Le score de l'adversaire se mettra automatiquement"]
[]
[null,"Exemple:"]
[null,"L' équipe 1 Gagne par 32 à 4 : il faut mettre 32 pour le score de L'équipe 1 contre l'équipe 2 (4 sera automatique)"]
[null,null,"Essayez : Tapez 32 ici"]
[]
[null,null,{"$f":"$B$1","v":"EXEMPT"},{"$f":"$B$2","v":"COURLON 1"},null,{"$f":"IF(E306=\"\",\"\",IF(E306=\"F\",\"G\",IF(E306=\"G\",\"F\",36-E306)))","v":""}]
[null,null,{"$f":"$B$3","v":"CHAMPIGNY 1"},"Equipe 4",null,{"$f":"IF(E307=\"\",\"\",IF(E307=\"F\",\"G\",IF(E307=\"G\",\"F\",36-E307)))","v":""}]
[]
[null,null,"Essayez : Tapez 17 ici"]
[]
[null,"L' équipe 4 Gagne par 19 à 17 : il faut mettre 17 pour le score de L'équipe 3 contre l'équipe 2 (19  sera automatique)"]
[]
[null,"5) Pour le Forfait : Mettre F si Premiere equipe Forfait sinon mettre G"]
[]
[null,"Exemple:"]
[null,"L' équipe 1 est forfait : il faut mettre un F pour le score de L'équipe 1 contre l'équipe 2 (G est automatique)"]
[null,null,"Essayez : Tapez un F ici"]
[]
[null,null,{"$f":"$B$1","v":"EXEMPT"},{"$f":"$B$2","v":"COURLON 1"},null,{"$f":"IF(E319=\"\",\"\",IF(E319=\"F\",\"G\",IF(E319=\"G\",\"F\",36-E319)))","v":""}]
[null,null,{"$f":"$B$3","v":"CHAMPIGNY 1"},"Equipe 4",null,{"$f":"IF(E320=\"\",\"\",IF(E320=\"F\",\"G\",IF(E320=\"G\",\"F\",36-E320)))","v":""}]
[]
[null,null,"Essayez : Tapez un G ici"]
[null,"L' équipe 4 est forfait : il faut mettre un G pour le score de L'équipe 3 contre l'équipe 4 (F est automatique)"]
[]
[]
[null,"En cas de Forfait : le score attribué est 19 à 0"]
[]
[null,"Ne pas oublier d'appuyer sur le bouton Maj Classement sous le Classement"]

{"sheet":"DIV 3 Gr B","index":1,"n_rows":328,"n_cols":22,"rows_kept":328,"cut":false,"hidden":false,"merged":[[29,1,29,10],[12,6,12,9],[13,6,13,7],[26,1,26,10],[27,1,27,10],[15,2,15,5],[20,2,20,5],[17,11,18,11],[10,6,10,9],[0,6,0,9],[5,6,5,9],[28,1,28,10],[0,2,0,5],[5,2,5,5],[10,2,10,5]]}
[1,"VAUX 3","Match 1: à BLENEAU - Dimanche 01 Septembre à 8H30",null,null,null,"Match 6: à AVALLON - Dimanche 06 Octobre à 14H00",null,null,null,null,null,null,null,null,null,null,"Pt","TPt","T+/-","+","-"]
[2,"RAVIERES 3",{"$f":"$B$1","v":"VAUX 3"},{"$f":"$B$2","v":"RAVIERES 3"},14,{"$f":"IF(E2=\"\",\"\",IF(E2=\"F\",\"G\",IF(E2=\"G\",\"F\",36-E2)))","v":22},{"$f":"$B$1","v":"VAUX 3"},{"$f":"$B$6","v":"BLENEAU 1"},34,{"$f":"IF(I2=\"\",\"\",IF(I2=\"F\",\"G\",IF(I2=\"G\",\"F\",36-I2)))","v":2},null,null,null,null,null,"ANCY LE FRANC 2",22,{"$f":"IF(Q2=\"\",\"\",IF(Q2=\"F\",0,IF(Q2=18,2,IF(Q2>18,3,1))))","v":3},null,null,{"$f":"IF(Q2=\"G\",19,IF(Q2=\"\",0,Q2))","v":22},{"$f":"IF(Q2=\"\",\"\",IF(U2=36,36,IF(U2=0,-36,IF(U2=19,19,IF(U2=\"f\",-19,U2-(36-U2))))))","v":8}]
[3,"ST VINNEMER 1",{"$f":"$B$3","v":"ST VINNEMER 1"},{"$f":"$B$4","v":"ANCY LE FRANC 2"},14,{"$f":"IF(E3=\"\",\"\",IF(E3=\"F\",\"G\",IF(E3=\"G\",\"F\",36-E3)))","v":22},{"$f":"$B$3","v":"ST VINNEMER 1"},{"$f":"$B$5","v":"MALAY LE GRAND 2"},10,{"$f":"IF(I3=\"\",\"\",IF(I3=\"F\",\"G\",IF(I3=\"G\",\"F\",36-I3)))","v":26},null,null,null,null,null,"ANCY LE FRANC 2",2,1,null,null,2,-32]
[4,"ANCY LE FRANC 2",{"$f":"$B$5","v":"MALAY LE GRAND 2"},{"$f":"$B$6","v":"BLENEAU 1"},16,{"$f":"IF(E4=\"\",\"\",IF(E4=\"F\",\"G\",IF(E4=\"G\",\"F\",36-E4)))","v":20},{"$f":"$B$7","v":"CHAMPIGNY 2"},{"$f":"$B$4","v":"ANCY LE FRANC 2"},22,{"$f":"IF(I4=\"\",\"\",IF(I4=\"F\",\"G\",IF(I4=\"G\",\"F\",36-I4)))","v":14},null,null,null,null,null,"ANCY LE FRANC 2",14,1,null,null,14,-8]
[5,"MALAY LE GRAND 2",{"$f":"$B$7","v":"CHAMPIGNY 2"},{"$f":"$B$8","v":"AVALLON 3"},4,{"$f":"IF(E5=\"\",\"\",IF(E5=\"F\",\"G\",IF(E5=\"G\",\"F\",36-E5)))","v":32},{"$f":"$B$8","v":"AVALLON 3"},{"$f":"$B$2","v":"RAVIERES 3"},20,{"$f":"IF(I5=\"\",\"\",IF(I5=\"F\",\"G\",IF(I5=\"G\",\"F\",36-I5)))","v":16},null,null,null,null,null,"ANCY LE FRANC 2",20,3,null,null,20,4]
[6,"BLENEAU 1","Match 2: à BLENEAU - Dimanche 01 Septembre à 14h00",null,null,null,"Match 7 et Finale: à MIGENNES - Dimanche 20 Octobre à 8H30",null,null,null,null,null,null,null,null,"ANCY LE FRANC 2",10,1,null,null,10,-16]
[7,"CHAMPIGNY 2",{"$f":"$B$4","v":"ANCY LE FRANC 2"},{"$f":"$B$1","v":"VAUX 3"},2,{"$f":"IF(E7=\"\",\"\",IF(E7=\"F\",\"G\",IF(E7=\"G\",\"F\",36-E7)))","v":34},{"$f":"$B$6","v":"BLENEAU 1"},{"$f":"$B$7","v":"CHAMPIGNY 2"},10,{"$f":"IF(I7=\"\",\"\",IF(I7=\"F\",\"G\",IF(I7=\"G\",\"F\",36-I7)))","v":26},null,null,null,null,null,"ANCY LE FRANC 2",14,1,null,null,14,-8]
[8,"AVALLON 3",{"$f":"$B$6","v":"BLENEAU 1"},{"$f":"$B$3","v":"ST VINNEMER 1"},24,{"$f":"IF(E8=\"\",\"\",IF(E8=\"F\",\"G\",IF(E8=\"G\",\"F\",36-E8)))","v":12},{"$f":"$B$4","v":"ANCY LE FRANC 2"},{"$f":"$B$2","v":"RAVIERES 3"},10,{"$f":"IF(I8=\"\",\"\",IF(I8=\"F\",\"G\",IF(I8=\"G\",\"F\",36-I8)))","v":26},null,null,null,null,null,"ANCY LE FRANC 2",10,1,{"$f":"SUM(R2:R8)","v":11},{"$f":"SUM(V2:V8)","v":-68},10,-16]
[null,null,{"$f":"$B$2","v":"RAVIERES 3"},{"$f":"$B$7","v":"CHAMPIGNY 2"},26,{"$f":"IF(E9=\"\",\"\",IF(E9=\"F\",\"G\",IF(E9=\"G\",\"F\",36-E9)))","v":10},{"$f":"$B$5","v":"MALAY LE GRAND 2"},{"$f":"$B$1","v":"VAUX 3"},22,{"$f":"IF(I9=\"\",\"\",IF(I9=\"F\",\"G\",IF(I9=\"G\",\"F\",36-I9)))","v":14},null,null,null,null,null,"AVALLON 3",32,3,null,null,32,28]
[null,null,{"$f":"$B$8","v":"AVALLON 3"},{"$f":"$B$5","v":"MALAY LE GRAND 2"},18,{"$f":"IF(E10=\"\",\"\",IF(E10=\"F\",\"G\",IF(E10=\"G\",\"F\",36-E10)))","v":18},{"$f":"$B$3","v":"ST VINNEMER 1"},{"$f":"$B$8","v":"AVALLON 3"},14,{"$f":"IF(I10=\"\",\"\",IF(I10=\"F\",\"G\",IF(I10=\"G\",\"F\",36-I10)))","v":22},null,null,null,null,null,"AVALLON 3",18,2,null,null,18,0]
["Rappel:",null,"Match 3: à MALAY LE GRAND - Dimanche 08 Septembre à 8h30",null,null,null,null,null,null,null,null,null,null,null,null,"AVALLON 3",34,3,null,null,34,32]
["Seules les Cases Blanches",null,{"$f":"$B$4","v":"ANCY LE FRANC 2"},{"$f":"$B$5","v":"MALAY LE GRAND 2"},14,{"$f":"IF(E12=\"\",\"\",IF(E12=\"F\",\"G\",IF(E12=\"G\",\"F\",36-E12)))","v":22},null,null,null,null,null,null,null,null,null,"AVALLON 3",14,1,null,null,14,-8]
["sont à remplir",null,{"$f":"$B$2","v":"RAVIERES 3"},{"$f":"$B$3","v":"ST VINNEMER 1"},30,{"$f":"IF(E13=\"\",\"\",IF(E13=\"F\",\"G\",IF(E13=\"G\",\"F\",36-E13)))","v":6},"Classement",null,null,null,null,null,null,null,null,"AVALLON 3",26,3,null,null,26,16]
[null,null,{"$f":"$B$7","v":"CHAMPIGNY 2"},{"$f":"$B$1","v":"VAUX 3"},4,{"$f":"IF(E14=\"\",\"\",IF(E14=\"F\",\"G\",IF(E14=\"G\",\"F\",36-E14)))","v":32},null,null,"Pts","+/-",null,null,null,null,null,"AVALLON 3",20,3,null,null,20,4]
[null,null,{"$f":"$B$6","v":"BLENEAU 1"},{"$f":"$B$8","v":"AVALLON 3"},2,{"$f":"IF(E15=\"\",\"\",IF(E15=\"F\",\"G\",IF(E15=\"G\",\"F\",36-E15)))","v":34},1,"RAVIERES 3",19,80,null,null,null,null,null,"AVALLON 3",22,3,{"$f":"SUM(R9:R15)","v":18},{"$f":"SUM(V9:V15)","v":80},22,8]
[null,null,"Match 4:  à MALAY LE GRAND - Dimanche 08 Septembre à 14H00",null,null,null,2,"AVALLON 3",18,80,null,null,null,null,null,"BLENEAU 1",20,3,null,null,20,4]
[null,null,{"$f":"$B$5","v":"MALAY LE GRAND 2"},{"$f":"$B$2","v":"RAVIERES 3"},14,{"$f":"IF(E17=\"\",\"\",IF(E17=\"F\",\"G\",IF(E17=\"G\",\"F\",36-E17)))","v":22},3,"VAUX 3",17,104,null,null,null,null,null,"BLENEAU 1",24,3,null,null,24,12]
[null,null,{"$f":"$B$6","v":"BLENEAU 1"},{"$f":"$B$4","v":"ANCY LE FRANC 2"},16,{"$f":"IF(E18=\"\",\"\",IF(E18=\"F\",\"G\",IF(E18=\"G\",\"F\",36-E18)))","v":20},4,"MALAY LE GRAND 2",16,52,null,null,null,null,null,"BLENEAU 1",2,1,null,null,2,-32]
[null,null,{"$f":"$B$3","v":"ST VINNEMER 1"},{"$f":"$B$7","v":"CHAMPIGNY 2"},18,{"$f":"IF(E19=\"\",\"\",IF(E19=\"F\",\"G\",IF(E19=\"G\",\"F\",36-E19)))","v":18},5,"CHAMPIGNY 2",12,-80,null,null,null,null,null,"BLENEAU 1",16,1,null,null,16,-4]
[null,null,{"$f":"$B$1","v":"VAUX 3"},{"$f":"$B$8","v":"AVALLON 3"},22,{"$f":"IF(E20=\"\",\"\",IF(E20=\"F\",\"G\",IF(E20=\"G\",\"F\",36-E20)))","v":14},6,"ANCY LE FRANC 2",11,-68,null,null,null,null,null,"BLENEAU 1",12,1,null,null,12,-12]
[null,null,"Match 5: à AVALLON - Dimanche 06 Octobre à 8H30",null,null,null,7,"BLENEAU 1",11,-80,null,null,null,null,null,"BLENEAU 1",2,1,null,null,2,-32]
[null,null,{"$f":"$B$1","v":"VAUX 3"},{"$f":"$B$3","v":"ST VINNEMER 1"},28,{"$f":"IF(E22=\"\",\"\",IF(E22=\"F\",\"G\",IF(E22=\"G\",\"F\",36-E22)))","v":8},8,"ST VINNEMER 1",8,-88,null,null,null,null,null,"BLENEAU 1",10,1,{"$f":"SUM(R16:R22)","v":11},{"$f":"SUM(V16:V22)","v":-80},10,-16]
[null,null,{"$f":"$B$2","v":"RAVIERES 3"},{"$f":"$B$6","v":"BLENEAU 1"},24,{"$f":"IF(E23=\"\",\"\",IF(E23=\"F\",\"G\",IF(E23=\"G\",\"F\",36-E23)))","v":12},null,null,null,null,null,null,null,null,null,"CHAMPIGNY 2",4,1,null,null,4,-28]
[null,null,{"$f":"$B$7","v":"CHAMPIGNY 2"},{"$f":"$B$5","v":"MALAY LE GRAND 2"},2,{"$f":"IF(E24=\"\",\"\",IF(E24=\"F\",\"G\",IF(E24=\"G\",\"F\",36-E24)))","v":34},null,null,null,null,null,null,null,null,null,"CHAMPIGNY 2",10,1,null,null,10,-16]
[null,null,{"$f":"$B$8","v":"AVALLON 3"},{"$f":"$B$4","v":"ANCY LE FRANC 2"},26,{"$f":"IF(E25=\"\",\"\",IF(E25=\"F\",\"G\",IF(E25=\"G\",\"F\",36-E25)))","v":10},null,null,null,null,null,null,null,null,null,"CHAMPIGNY 2",4,1,null,null,4,-28]
[null,null,null,null,null,null,null,null,null,null,null,null,null,null,null,"CHAMPIGNY 2",18,2,null,null,18,0]
[null,"FÉDÉRATION FRANÇAISE DE PÉTANQUE ET JEU PROVENÇAL",null,null,null,null,null,null,null,null,null,null,null,null,null,"CHAMPIGNY 2",2,1,null,null,2,-32]
[null,"AGRÉÉE PAR LE MINISTÈRE DE LA JEUNESSE ET  DES SPORTS ",null,null,null,null,null,null,null,null,null,null,null,null,null,"CHAMPIGNY 2",22,3,null,null,22,8]
[null,"TERRITOIRE DE BOURGOGNE ",null,null,null,null,null,null,null,null,null,null,null,null,null,"CHAMPIGNY 2",26,3,{"$f":"SUM(R23:R29)","v":12},{"$f":"SUM(V23:V29)","v":-80},26,16]
[null,"Championnat Départemental des Clubs 2024 Division 3 Groupe B",null,null,null,null,null,null,null,null,null,null,null,null,null,"MALAY LE GRAND 2",16,1,null,null,16,-4]
[null,null,null,null,null,null,null,null,null,null,null,null,null,null,null,"MALAY LE GRAND 2",18,2,null,null,18,0]
[null,null,null,null,null,null,null,null,null,null,null,null,null,null,null,"MALAY LE GRAND 2",22,3,null,null,22,8]
[null,null,null,null,null,null,null,null,null,null,null,null,null,null,null,"MALAY LE GRAND 2",14,1,null,null,14,-8]
[null,null,null,null,null,null,null,null,null,null,null,null,null,null,null,"MALAY LE GRAND 2",34,{"$f":"IF(Q34=\"\",\"\",IF(Q34=\"F\",0,IF(Q34=18,2,IF(Q34>18,3,1))))","v":3},null,null,{"$f":"IF(Q34=\"G\",19,IF(Q34=\"\",0,Q34))","v":34},{"$f":"IF(Q34=\"\",\"\",IF(U34=36,36,IF(U34=0,-36,IF(U34=19,19,IF(U34=\"f\",-19,U34-(36-U34))))))","v":32}]
[null,null,null,null,null,null,null,null,null,null,null,null,null,null,null,"MALAY LE GRAND 2",26,3,null,null,26,16]
[null,null,null,null,null,null,null,null,null,null,null,null,null,null,null,"MALAY LE GRAND 2",22,3,{"$f":"SUM(R30:R36)","v":16},{"$f":"SUM(V30:V36)","v":52},22,8]
[null,null,null,null,null,null,null,null,null,null,null,null,null,null,null,"RAVIERES 3",22,3,null,null,22,8]
[null,null,null,null,null,null,null,null,null,null,null,null,null,null,null,"RAVIERES 3",26,3,null,null,26,16]
[null,null,null,null,null,null,null,null,null,null,null,null,null,null,null,"RAVIERES 3",30,3,null,null,30,24]
[null,null,null,null,null,null,null,null,null,null,null,null,null,null,null,"RAVIERES 3",22,3,null,null,22,8]
[null,null,null,null,null,null,null,null,null,null,null,null,null,null,null,"RAVIERES 3",24,3,null,null,24,12]
[null,null,null,null,null,null,null,null,null,null,null,null,null,null,null,"RAVIERES 3",16,1,null,null,16,-4]
[null,null,null,null,null,null,null,null,null,null,null,null,null,null,null,"RAVIERES 3",26,3,{"$f":"SUM(R37:R43)","v":19},{"$f":"SUM(V37:V43)","v":80},26,16]
[null,null,null,null,null,null,null,null,null,null,null,null,null,null,null,"ST VINNEMER 1",14,1,null,null,14,-8]
[null,null,null,null,null,null,null,null,null,null,null,null,null,null,null,"ST VINNEMER 1",12,1,null,null,12,-12]
[null,null,null,null,null,null,null,null,null,null,null,null,null,null,null,"ST VINNEMER 1",6,1,null,null,6,-24]
[null,null,null,null,null,null,null,null,null,null,null,null,null,null,null,"ST VINNEMER 1",18,2,null,null,18,0]
[null,null,null,null,null,null,null,null,null,null,null,null,null,null,null,"ST VINNEMER 1",8,1,null,null,8,-20]
[null,null,null,null,null,null,null,null,null,null,null,null,null,null,null,"ST VINNEMER 1",10,1,null,null,10,-16]
[null,null,null,null,null,null,null,null,null,null,null,null,null,null,null,"ST VINNEMER 1",14,1,{"$f":"SUM(R44:R50)","v":8},{"$f":"SUM(V44:V50)","v":-88},14,-8]
[null,null,null,null,null,null,null,null,null,null,null,null,null,null,null,"VAUX 3",14,1,null,null,14,-8]
[null,null,null,null,null,null,null,null,null,null,null,null,null,null,null,"VAUX 3",34,3,null,null,34,32]
[null,null,null,null,null,null,null,null,null,null,null,null,null,null,null,"VAUX 3",32,3,null,null,32,28]
[null,null,null,null,null,null,null,null,null,null,null,null,null,null,null,"VAUX 3",22,3,null,null,22,8]
[null,null,null,null,null,null,null,null,null,null,null,null,null,null,null,"VAUX 3",28,3,null,null,28,20]
[null,null,null,null,null,null,null,null,null,null,null,null,null,null,null,"VAUX 3",34,3,null,null,34,32]
[null,null,null,null,null,null,null,null,null,null,null,null,null,null,null,"VAUX 3",14,1,{"$f":"SUM(R51:R57)","v":17},{"$f":"SUM(V51:V57)","v":104},14,-8]
[null,null,null,null,null,null,null,null,null,null,null,null,null,null,null,null,null,null,null,null,null,{"$f":"IF(U58=0,\"\",IF(U58=19,\"\",U58-(36-U58)))","v":""}]
[]
[]
[]
[]
[]
[]
[]
[]
[]
[]
[]
[]
[]
[]
[]
[]
[]
[]
[]
[]
[]
[]
[]
[]
[]
[]
[]
[]
[]
[]
[]
[]
[]
[]
[]
[]
[]
[]
[]
[]
[]
[]
[]
[]
[]
[]
[]
[]
[]
[]
[]
[]
[]
[]
[]
[]
[]
[]
[]
[]
[]
[]
[]
[]
[]
[]
[]
[]
[]
[]
[]
[]
[]
[]
[]
[]
[]
[]
[]
[]
[]
[]
[]
[]
[]
[]
[]
[]
[]
[]
[]
[]
[]
[]
[]
[]
[]
[]
[]
[]
[]
[]
[]
[]
[]
[]
[]
[]
[]
[]
[]
[]
[]
[]
[]
[]
[]
[]
[]
[]
[]
[]
[]
[]
[]
[]
[]
[]
[]
[]
[]
[]
[]
[]
[]
[]
[]
[]
[]
[]
[]
[]
[]
[]
[]
[]
[]
[]
[]
[]
[]
[]
[]
[]
[]
[]
[]
[]
[]
[]
[]
[]
[]
[]
[]
[]
[]
[]
[]
[]
[]
[]
[]
[]
[]
[]
[]
[]
[]
[]
[]
[]
[]
[]
[]
[]
[]
[]
[]
[]
[]
[]
[]
[]
[]
[]
[]
[]
[]
[]
[]
[]
[]
[]
[]
[]
[]
[]
[]
[]
[]
[]
[]
[]
[]
[]
[]
[]
[]
[]
[]
[]
[]
[]
[]
[]
[]
[]
[]
[]
[]
[]
[]
[]
[]
[null,"1) Remplir la liste des Clubs composant le Groupe (Colonne B1 à B14)"]
[]
[null,"2) Le calendrier se fait automatiquement"]
[]
[null,"3) Pour chaque rencontre: mettre uniquemment le score de la premiere équipe (Case Blanche,la rouge sera remplie automatiquement)"]
[]
[null,"4) Le score de l'adversaire se mettra automatiquement"]
[]
[null,"Exemple:"]
[null,"L' équipe 1 Gagne par 32 à 4 : il faut mettre 32 pour le score de L'équipe 1 contre l'équipe 2 (4 sera automatique)"]
[null,null,"Essayez : Tapez 32 ici"]
[]
[null,null,{"$f":"$B$1","v":"VAUX 3"},{"$f":"$B$2","v":"RAVIERES 3"},null,{"$f":"IF(E306=\"\",\"\",IF(E306=\"F\",\"G\",IF(E306=\"G\",\"F\",36-E306)))","v":""}]
[null,null,{"$f":"$B$3","v":"ST VINNEMER 1"},"Equipe 4",null,{"$f":"IF(E307=\"\",\"\",IF(E307=\"F\",\"G\",IF(E307=\"G\",\"F\",36-E307)))","v":""}]
[]
[null,null,"Essayez : Tapez 17 ici"]
[]
[null,"L' équipe 4 Gagne par 19 à 17 : il faut mettre 17 pour le score de L'équipe 3 contre l'équipe 2 (19  sera automatique)"]
[]
[null,"5) Pour le Forfait : Mettre F si Premiere equipe Forfait sinon mettre G"]
[]
[null,"Exemple:"]
[null,"L' équipe 1 est forfait : il faut mettre un F pour le score de L'équipe 1 contre l'équipe 2 (G est automatique)"]
[null,null,"Essayez : Tapez un F ici"]
[]
[null,null,{"$f":"$B$1","v":"VAUX 3"},{"$f":"$B$2","v":"RAVIERES 3"},null,{"$f":"IF(E319=\"\",\"\",IF(E319=\"F\",\"G\",IF(E319=\"G\",\"F\",36-E319)))","v":""}]
[null,null,{"$f":"$B$3","v":"ST VINNEMER 1"},"Equipe 4",null,{"$f":"IF(E320=\"\",\"\",IF(E320=\"F\",\"G\",IF(E320=\"G\",\"F\",36-E320)))","v":""}]
[]
[null,null,"Essayez : Tapez un G ici"]
[null,"L' équipe 4 est forfait : il faut mettre un G pour le score de L'équipe 3 contre l'équipe 4 (F est automatique)"]
[]
[]
[null,"En cas de Forfait : le score attribué est 19 à 0"]
[]
[null,"Ne pas oublier d'appuyer sur le bouton Maj Classement sous le Classement"]

{"sheet":"CLASST ","index":2,"n_rows":24,"n_cols":10,"rows_kept":24,"cut":false,"hidden":false,"merged":[[21,1,21,5],[1,7,2,8],[3,7,3,8],[11,1,11,5],[17,9,19,9],[5,9,7,9]]}
[]
[null,"GROUPE A",null,"GROUPE B",null,null,null,"D3"]
[1,"CHAMPIGNY 1",1,"RAVIERES 3"]
[2,"ST MARTIN DU TERTRE 1",2,"AVALLON 3",null,null,null,"CLASSEMENT 2024"]
[3,"VILLENEUVE PETANQUE 1",3,"VAUX 3",null,null,null,1,"RAVIERES 3"]
[4,"ST FLORENTIN 3",4,"MALAY LE GRAND 2",null,null,null,2,"CHAMPIGNY 1","SUSCEPTIBLE  DE MONTER EN D2 POUR 2025"]
[5,"COURLON 1",5,"CHAMPIGNY 2",null,null,null,3,"AVALLON 3"]
[6,"MIGENNES 3",6,"ANCY LE FRANC 2",null,null,null,4,"ST MARTIN DU TERTRE 1"]
[7,"SENAN 3",7,"BLENEAU 1",null,null,null,5,"VAUX 3"]
[8,"EXEMPT",8,"ST VINNEMER 1",null,null,null,6,"VILLENEUVE PETANQUE 1"]
[null,null,null,null,null,null,null,7,"ST FLORENTIN 3"]
[null,"TOUR FINAL",null,null,null,null,null,8,"MALAY LE GRAND 2"]
[null,"CHAMPIGNY 1","CONTRE","RAVIERES 3",12,24,null,9,"COURLON 1"]
[null,"ST MARTIN DU TERTRE 1","CONTRE","AVALLON 3",10,26,null,10,"CHAMPIGNY 2"]
[null,"VILLENEUVE PETANQUE 1","CONTRE","VAUX 3",12,24,null,11,"MIGENNES 3"]
[null,"ST FLORENTIN 3","CONTRE","MALAY LE GRAND 2",24,12,null,12,"ANCY LE FRANC 2"]
[null,"COURLON 1","CONTRE","CHAMPIGNY 2",32,4,null,13,"SENAN 3"]
[null,"MIGENNES 3","CONTRE","ANCY LE FRANC 2",32,4,null,14,"BLENEAU 1","SUSCEPTIBLE DE DESCENDRE EN D4 POUR 2025"]
[null,"SENAN 3","CONTRE","BLENEAU 1",28,8,null,15,"ST VINNEMER 1"]
[null,"EXEMPT","CONTRE","ST VINNEMER 1","F","G",null,16,"EXEMPT"]
[]
[null,"TIR DE DEPARTAGE"]
[null,null,"CONTRE",null,4,7]
[null,null,"CONTRE",null,"G","P"]